Target
Diacylglycerol lipase-beta
Ligand
BDBM50211236
Substrate
Meas. Tech.
ChEMBL_1924059 (CHEMBL4427015)
IC50
79±n/a nM
Citation
 Janssen, FJvan der Stelt, M Inhibitors of diacylglycerol lipases in neurodegenerative and metabolic disorders. Bioorg Med Chem Lett 26:3831-7 (2016)  
Target
Name:
Diacylglycerol lipase-beta
Synonyms:
DGL-beta Daglb | Sn1-specific diacylglycerol lipase beta
Type:
PROTEIN
Mol. Mass.:
73906.34
Organism:
Mus musculus
Description:
ChEMBL_101275
Residue:
669
  
Inhibitor
Name:
BDBM50211236
Synonyms:
CHEMBL2144065
Type:
Small organic molecule
Emp. Form.:
C27H26N4O
Mol. Mass.:
422.5215
SMILES:
O=C(N1CCCCC1Cc1ccccc1)n1cc(nn1)-c1ccc(cc1)-c1ccccc1
: