Target
Diacylglycerol lipase-beta
Ligand
BDBM50532885
Substrate
Meas. Tech.
ChEMBL_1924053 (CHEMBL4427009)
IC50
6.3±n/a nM
Citation
 Janssen, FJvan der Stelt, M Inhibitors of diacylglycerol lipases in neurodegenerative and metabolic disorders. Bioorg Med Chem Lett 26:3831-7 (2016)  
Target
Name:
Diacylglycerol lipase-beta
Synonyms:
DAGLB Sn1-specific diacylglycerol lipase beta
Type:
PROTEIN
Mol. Mass.:
73731.79
Organism:
Homo sapiens (Human)
Description:
ChEMBL_557688
Residue:
672
  
Inhibitor
Name:
BDBM50532885
Synonyms:
CHEMBL4470017
Type:
Small organic molecule
Emp. Form.:
C29H53NO5
Mol. Mass.:
495.7348
SMILES:
CCCCCCCCCCCC(C[C@@H]1OC(=O)[C@H]1CCCCCC)OC(=O)[C@@H](NC=O)C(C)CC
: