Target
Diacylglycerol lipase-alpha
Ligand
BDBM50211236
Substrate
Meas. Tech.
ChEMBL_1924054 (CHEMBL4427010)
IC50
25±n/a nM
Citation
 Janssen, FJvan der Stelt, M Inhibitors of diacylglycerol lipases in neurodegenerative and metabolic disorders. Bioorg Med Chem Lett 26:3831-7 (2016)  
Target
Name:
Diacylglycerol lipase-alpha
Synonyms:
C11orf11 DGLA_HUMAN NSDDR | Sn1-specific diacylglycerol lipase alpha
Type:
PROTEIN
Mol. Mass.:
114947.74
Organism:
Homo sapiens (Human)
Description:
ChEMBL_1449471
Residue:
1042
  
Inhibitor
Name:
BDBM50211236
Synonyms:
CHEMBL2144065
Type:
Small organic molecule
Emp. Form.:
C27H26N4O
Mol. Mass.:
422.5215
SMILES:
O=C(N1CCCCC1Cc1ccccc1)n1cc(nn1)-c1ccc(cc1)-c1ccccc1
: