Target
Carbonic anhydrase 2
Ligand
BDBM10868
Substrate
Meas. Tech.
ChEMBL_1925023 (CHEMBL4427979)
Ki
60±n/a nM
Citation
 Del Prete, SVullo, DDe Luca, VCarginale, VOsman, SMAlOthman, ZSupuran, CTCapasso, C Cloning, expression, purification and sulfonamide inhibition profile of the complete domain of the ?-carbonic anhydrase from Plasmodium falciparum. Bioorg Med Chem Lett 26:4184-90 (2016)  
Target
Name:
Carbonic anhydrase 2
Synonyms:
CA-II CAC Carbonate dehydratase II Carbonic anhydrase 2 (CA-II) Carbonic anhydrase C Carbonic anhydrase II (CA-II) Carbonic anhydrase II (hCA II) | Carbonic anhydrase isoenzyme II (hCA II)
Type:
Enzyme
Mol. Mass.:
29250.71
Organism:
Homo sapiens (Human)
Description:
P00918
Residue:
260
  
Inhibitor
Name:
BDBM10868
Synonyms:
1,3,4-Thiadiazole-2-sulfonamide, 6 5-Amino-1,3,4-thiadiazole-2-sulphonamide (1) CHEMBL265674 | aromatic/heteroaromatic sulfonamide 13
Type:
Small organic molecule
Emp. Form.:
C2H4N4O2S2
Mol. Mass.:
180.209
SMILES:
Nc1nnc(s1)S(N)(=O)=O
: