Target
Aldo-keto reductase family 1 member C3
Ligand
BDBM50533570
Substrate
Meas. Tech.
ChEMBL_1925934 (CHEMBL4429006)
Ki
750±n/a nM
Citation
 Adeniji, AUddin, MJZang, TTamae, DWangtrakuldee, PMarnett, LJPenning, TM Discovery of (R)-2-(6-Methoxynaphthalen-2-yl)butanoic Acid as a Potent and Selective Aldo-keto Reductase 1C3 Inhibitor. J Med Chem 59:7431-44 (2016)  
Target
Name:
Aldo-keto reductase family 1 member C3
Synonyms:
17-beta-Hydroxysteroid Dehydrogenase 5 (17-beta-HSD5, AKR1C3) AK1C3_HUMAN Aldo-keto reductase family 1 member C3 Aldo-keto reductase family 1 member C3 (AK1C3a) Aldo-keto-reductase family 1 member C3 Dihydrodiol dehydrogenase 3 Estradiol 17-beta-dehydrogenase KIAA0119 Prostaglandin F synthase Trans-1,2-dihydrobenzene-1,2-diol dehydrogenase
Type:
Enzyme
Mol. Mass.:
36859.86
Organism:
Homo sapiens (Human)
Description:
P42330
Residue:
323
  
Inhibitor
Name:
BDBM50533570
Synonyms:
CHEMBL4435662 | US11459295, Compound LM5750A 8b
Type:
Small organic molecule
Emp. Form.:
C15H16O3
Mol. Mass.:
244.2857
SMILES:
CC[C@@H](C(O)=O)c1ccc2cc(OC)ccc2c1
: