Target
Acetylcholinesterase
Ligand
BDBM50070476
Substrate
Meas. Tech.
ChEBML_28133
Ki
5±n/a nM
Citation
 Moon, SCShin, JHJeong, BHKim, HSYu, BSLee, JSLee, BSNamgoong, SK Synthesis of tetrakis(multifluoro-4-pyridyl)porphin derivatives as acetylcholinesterase inhibitors. Bioorg Med Chem Lett 10:1435-8 (2000)  
Target
Name:
Acetylcholinesterase
Synonyms:
ACES_ELEEL Acetylcholinesterase (EeAChE) | ache
Type:
Enzyme
Mol. Mass.:
71812.79
Organism:
Electrophorus electricus (Electric eel)
Description:
Residue:
633
  
Inhibitor
Name:
BDBM50070476
Synonyms:
(1Z,4Z,9Z,15Z)-5,10,15,20-Tetrakis-(2,6-difluoro-phenyl)-porphyrin | CHEMBL284754
Type:
Small organic molecule
Emp. Form.:
C44H22F8N4
Mol. Mass.:
758.6595
SMILES:
Fc1cccc(F)c1-c1c2ccc(n2)c(-c2c(F)cccc2F)c2ccc([nH]2)c(-c2c(F)cccc2F)c2ccc([nH]2)c(-c2c(F)cccc2F)c2ccc1n2
: