Target
Polyunsaturated fatty acid lipoxygenase ALOX15
Ligand
BDBM50417153
Substrate
Meas. Tech.
ChEMBL_1927853 (CHEMBL4430925)
IC50
60±n/a nM
Citation
 Armstrong, Mvan Hoorebeke, CHorn, TDeschamps, JFreedman, JCKalyanaraman, CJacobson, MPHolman, T Human 15-LOX-1 active site mutations alter inhibitor binding and decrease potency. Bioorg Med Chem 24:5380-5387 (2016)  
Target
Name:
Polyunsaturated fatty acid lipoxygenase ALOX15
Synonyms:
15-Lipoxygenase-1 (15-LOX-1) Arachidonate 15-lipoxygenase LOG15 Reticulocyte 15-lipoxygenase-1 | Sphingosine 1-phosphate receptor 1 (S1P1)
Type:
Protein
Mol. Mass.:
74804.05
Organism:
Homo sapiens (Human)
Description:
Residue:
662
  
Inhibitor
Name:
BDBM50417153
Synonyms:
CHEMBL1270704
Type:
Small organic molecule
Emp. Form.:
C27H18N2O3S
Mol. Mass.:
450.508
SMILES:
O=C(OCC#CCSc1nnc(o1)-c1cccc2ccccc12)c1ccc2ccccc2c1
: