Target
2-5A-dependent ribonuclease
Ligand
BDBM50421415
Substrate
Meas. Tech.
ChEMBL_195098 (CHEMBL800845)
IC50
13±n/a nM
Citation
 Wang, ZChen, LBayly, SFTorrence, PF Convergent synthesis of ribonuclease L-active 2',5'-oligoadenylate-peptide nucleic acids. Bioorg Med Chem Lett 10:1357-60 (2000)  
Target
Name:
2-5A-dependent ribonuclease
Synonyms:
2-5A-dependent RNase RN5A_HUMAN RNS4 Ribonuclease 4 | Ribonuclease L
Type:
PROTEIN
Mol. Mass.:
83534.35
Organism:
Homo sapiens (Human)
Description:
ChEMBL_164152
Residue:
741
  
Inhibitor
Name:
BDBM50421415
Synonyms:
CHEMBL414948
Type:
Small organic molecule
Emp. Form.:
C30H38N15O19P3
Mol. Mass.:
1005.6331
SMILES:
Nc1ncnc2n(cnc12)[C@@H]1O[C@H](CO[P@](O)(=O)O[C@@H]2[C@H](O)[C@@H](CO[P@](O)(=O)O[C@@H]3[C@H](O)[C@@H](COP(O)(O)=O)O[C@H]3n3cnc4c(N)ncnc34)O[C@H]2n2cnc3c(N)ncnc23)[C@@H](O)[C@H]1O
: