Target
Tyrosyl-DNA phosphodiesterase 1
Ligand
BDBM81347
Substrate
Meas. Tech.
ChEMBL_1928072 (CHEMBL4431144)
IC50
360±n/a nM
Citation
 Laev, SSSalakhutdinov, NFLavrik, OI Tyrosyl-DNA phosphodiesterase inhibitors: Progress and potential. Bioorg Med Chem 24:5017-5027 (2016)  
Target
Name:
Tyrosyl-DNA phosphodiesterase 1
Synonyms:
TDP1 Tyrosyl-DNA phosphodiesterase 1 | Tyrosyl-DNA phosphodiesterase 1 (TDP1)
Type:
Enzyme
Mol. Mass.:
68430.66
Organism:
Homo sapiens (Human)
Description:
Q9NUW8
Residue:
608
  
Inhibitor
Name:
BDBM81347
Synonyms:
L2037 (beta-lapachone)
Type:
Small organic molecule
Emp. Form.:
C7H8N2O3
Mol. Mass.:
168.15
SMILES:
CN(N=O)c1ccc(O)c(O)c1
: