Target
L-lactate dehydrogenase A chain
Ligand
BDBM50534316
Substrate
Meas. Tech.
ChEMBL_1928156 (CHEMBL4431228)
IC50
15±n/a nM
Citation
 Purkey, HERobarge, KChen, JChen, ZCorson, LBDing, CZDiPasquale, AGDragovich, PSEigenbrot, CEvangelista, MFauber, BPGao, ZGe, HHitz, AHo, QLabadie, SSLai, KWLiu, WLiu, YLi, CMa, SMalek, SO'Brien, TPang, JPeterson, DSalphati, LSideris, SUltsch, MWei, BYen, IYue, QZhang, HZhou, A Cell Active Hydroxylactam Inhibitors of Human Lactate Dehydrogenase with Oral Bioavailability in Mice. ACS Med Chem Lett 7:896-901 (2016)  
Target
Name:
L-lactate dehydrogenase A chain
Synonyms:
Cell proliferation-inducing gene 19 protein L-lactate dehydrogenase A Chain LDH-A LDHA Lactate dehydrogenase A (LDHA) | Renal carcinoma antigen NY-REN-59
Type:
Protein
Mol. Mass.:
36694.85
Organism:
Homo sapiens (Human)
Description:
P00338::PDB Code: 4ajp
Residue:
332
  
Inhibitor
Name:
BDBM50534316
Synonyms:
CHEMBL4453059
Type:
Small organic molecule
Emp. Form.:
C23H21ClN2O2S2
Mol. Mass.:
457.008
SMILES:
CN(C)c1ccc(cc1)C1(CC(O)=C(Sc2ccccc2Cl)C(=O)N1)c1ccsc1
: