Target
L-lactate dehydrogenase A chain
Ligand
BDBM50534318
Substrate
Meas. Tech.
ChEMBL_1928156 (CHEMBL4431228)
IC50
3.0±n/a nM
Citation
 Purkey, HERobarge, KChen, JChen, ZCorson, LBDing, CZDiPasquale, AGDragovich, PSEigenbrot, CEvangelista, MFauber, BPGao, ZGe, HHitz, AHo, QLabadie, SSLai, KWLiu, WLiu, YLi, CMa, SMalek, SO'Brien, TPang, JPeterson, DSalphati, LSideris, SUltsch, MWei, BYen, IYue, QZhang, HZhou, A Cell Active Hydroxylactam Inhibitors of Human Lactate Dehydrogenase with Oral Bioavailability in Mice. ACS Med Chem Lett 7:896-901 (2016)  
Target
Name:
L-lactate dehydrogenase A chain
Synonyms:
Cell proliferation-inducing gene 19 protein L-lactate dehydrogenase A Chain LDH-A LDHA Lactate dehydrogenase A (LDHA) | Renal carcinoma antigen NY-REN-59
Type:
Protein
Mol. Mass.:
36694.85
Organism:
Homo sapiens (Human)
Description:
P00338::PDB Code: 4ajp
Residue:
332
  
Inhibitor
Name:
BDBM50534318
Synonyms:
CHEMBL4576717
Type:
Small organic molecule
Emp. Form.:
C27H20ClFN2O2S2
Mol. Mass.:
523.041
SMILES:
OC1=C(Sc2ccccc2Cl)C(=O)NC(C1)(c1ccsc1)c1cccc(Nc2ccc(F)cc2)c1
: