Target
L-lactate dehydrogenase B chain
Ligand
BDBM50534329
Substrate
Meas. Tech.
ChEMBL_1928157 (CHEMBL4431229)
IC50
57±n/a nM
Citation
 Purkey, HERobarge, KChen, JChen, ZCorson, LBDing, CZDiPasquale, AGDragovich, PSEigenbrot, CEvangelista, MFauber, BPGao, ZGe, HHitz, AHo, QLabadie, SSLai, KWLiu, WLiu, YLi, CMa, SMalek, SO'Brien, TPang, JPeterson, DSalphati, LSideris, SUltsch, MWei, BYen, IYue, QZhang, HZhou, A Cell Active Hydroxylactam Inhibitors of Human Lactate Dehydrogenase with Oral Bioavailability in Mice. ACS Med Chem Lett 7:896-901 (2016)  
Target
Name:
L-lactate dehydrogenase B chain
Synonyms:
L-lactate dehydrogenase B LDH heart subunit LDH-H LDHB_HUMAN Renal carcinoma antigen NY-REN-46
Type:
Oxidoreductase; homotetramer
Mol. Mass.:
36635.55
Organism:
Homo sapiens (Human)
Description:
Residue:
334
  
Inhibitor
Name:
BDBM50534329
Synonyms:
CHEMBL4521960
Type:
Small organic molecule
Emp. Form.:
C21H16ClNO3S2
Mol. Mass.:
429.94
SMILES:
OC1=C(Sc2ccccc2Cl)C(=O)NC(C1)(c1ccsc1)c1ccc(O)cc1
: