Target
L-lactate dehydrogenase B chain
Ligand
BDBM50534323
Substrate
Meas. Tech.
ChEMBL_1928157 (CHEMBL4431229)
IC50
50±n/a nM
Citation
 Purkey, HERobarge, KChen, JChen, ZCorson, LBDing, CZDiPasquale, AGDragovich, PSEigenbrot, CEvangelista, MFauber, BPGao, ZGe, HHitz, AHo, QLabadie, SSLai, KWLiu, WLiu, YLi, CMa, SMalek, SO'Brien, TPang, JPeterson, DSalphati, LSideris, SUltsch, MWei, BYen, IYue, QZhang, HZhou, A Cell Active Hydroxylactam Inhibitors of Human Lactate Dehydrogenase with Oral Bioavailability in Mice. ACS Med Chem Lett 7:896-901 (2016)  
Target
Name:
L-lactate dehydrogenase B chain
Synonyms:
L-lactate dehydrogenase B LDH heart subunit LDH-H LDHB_HUMAN Renal carcinoma antigen NY-REN-46
Type:
Oxidoreductase; homotetramer
Mol. Mass.:
36635.55
Organism:
Homo sapiens (Human)
Description:
Residue:
334
  
Inhibitor
Name:
BDBM50534323
Synonyms:
CHEMBL4444963
Type:
Small organic molecule
Emp. Form.:
C25H23ClN2O2S2
Mol. Mass.:
483.045
SMILES:
OC1=C(Sc2ccccc2Cl)C(=O)NC(C1)(c1ccsc1)c1ccc(cc1)N1CCCC1
: