Target
L-lactate dehydrogenase A chain
Ligand
BDBM50534335
Substrate
Meas. Tech.
ChEMBL_1928156 (CHEMBL4431228)
IC50
13±n/a nM
Citation
 Purkey, HERobarge, KChen, JChen, ZCorson, LBDing, CZDiPasquale, AGDragovich, PSEigenbrot, CEvangelista, MFauber, BPGao, ZGe, HHitz, AHo, QLabadie, SSLai, KWLiu, WLiu, YLi, CMa, SMalek, SO'Brien, TPang, JPeterson, DSalphati, LSideris, SUltsch, MWei, BYen, IYue, QZhang, HZhou, A Cell Active Hydroxylactam Inhibitors of Human Lactate Dehydrogenase with Oral Bioavailability in Mice. ACS Med Chem Lett 7:896-901 (2016)  
Target
Name:
L-lactate dehydrogenase A chain
Synonyms:
Cell proliferation-inducing gene 19 protein L-lactate dehydrogenase A Chain LDH-A LDHA Lactate dehydrogenase A (LDHA) | Renal carcinoma antigen NY-REN-59
Type:
Protein
Mol. Mass.:
36694.85
Organism:
Homo sapiens (Human)
Description:
P00338::PDB Code: 4ajp
Residue:
332
  
Inhibitor
Name:
BDBM50534335
Synonyms:
CHEMBL4536094
Type:
Small organic molecule
Emp. Form.:
C25H23ClN2O4S3
Mol. Mass.:
547.109
SMILES:
OC1=C(Sc2ccccc2Cl)C(=O)NC(C1)(c1ccsc1)c1ccc(cc1)N1CCS(=O)(=O)CC1
: