Target
Tyrosine-protein phosphatase non-receptor type 11
Ligand
BDBM50054344
Substrate
Meas. Tech.
ChEMBL_1928760 (CHEMBL4431936)
IC50
200±n/a nM
Citation
 Garcia Fortanet, JChen, CHChen, YNChen, ZDeng, ZFirestone, BFekkes, PFodor, MFortin, PDFridrich, CGrunenfelder, DHo, SKang, ZBKarki, RKato, MKeen, NLaBonte, LRLarrow, JLenoir, FLiu, GLiu, SLombardo, FMajumdar, DMeyer, MJPalermo, MPerez, LPu, MRamsey, TSellers, WRShultz, MDStams, TTowler, CWang, PWilliams, SLZhang, JHLaMarche, MJ Allosteric Inhibition of SHP2: Identification of a Potent, Selective, and Orally Efficacious Phosphatase Inhibitor. J Med Chem 59:7773-82 (2016)  
Target
Name:
Tyrosine-protein phosphatase non-receptor type 11
Synonyms:
3.1.3.48 PTP-1D PTP2C Protein-tyrosine phosphatase 1D SH-PTP2 SHP-2 Shp2
Type:
PROTEIN
Mol. Mass.:
68018.07
Organism:
Homo sapiens
Description:
ChEMBL_11523
Residue:
593
  
Inhibitor
Name:
BDBM50054344
Synonyms:
CHEMBL3319356 US9844535, ID 11a-1 L97M74
Type:
Small organic molecule
Emp. Form.:
C28H20IN3O5S
Mol. Mass.:
637.445
SMILES:
Cn1c(c(I)c2cc(C(O)=O)c(O)cc12)-c1cccc(NC(=O)C(=O)Nc2ccc(cc2)-c2ccsc2)c1
: