Target
Dipeptidyl peptidase 4
Ligand
BDBM11695
Substrate
Meas. Tech.
ChEMBL_1928893 (CHEMBL4432069)
Kd
2.4±n/a nM
Citation
 Schnapp, GKlein, THoevels, YBakker, RANar, H Comparative Analysis of Binding Kinetics and Thermodynamics of Dipeptidyl Peptidase-4 Inhibitors and Their Relationship to Structure. J Med Chem 59:7466-77 (2016)  
Target
Name:
Dipeptidyl peptidase 4
Synonyms:
ADABP Adenosine deaminase complexing protein 2 CD_antigen=CD26 DPP4 DPPIV Dipeptidyl peptidase 4 (DPP IV) Dipeptidyl peptidase 4 (DPP4) Dipeptidyl peptidase 4 membrane form Dipeptidyl peptidase IV Dipeptidyl peptidase IV (DDP-IV) Dipeptidyl peptidase IV membrane form Dipeptidyl peptidase-IV (DPP-4) T-cell activation antigen CD26 | TP103
Type:
Enzyme
Mol. Mass.:
88271.01
Organism:
Homo sapiens (Human)
Description:
P27487
Residue:
766
  
Inhibitor
Name:
BDBM11695
Synonyms:
(2S)-1-{2-[(3-hydroxyadamantan-1-yl)amino]acetyl}pyrrolidine-2-carbonitrile NVP-LAF237
Type:
Small organic molecule
Emp. Form.:
C17H25N3O2
Mol. Mass.:
303.3993
SMILES:
OC12CC3CC(C1)CC(C3)(C2)NCC(=O)N1CCC[C@H]1C#N
: