Target
Cannabinoid receptor 1
Ligand
BDBM50534476
Substrate
Meas. Tech.
ChEMBL_1929056 (CHEMBL4432232)
Ki
1.2±n/a nM
Citation
 Seltzman, HHShiner, CHirt, EEGilliam, AFThomas, BFMaitra, RSnyder, RBlack, SLPatel, PRMulpuri, YSpigelman, I Peripherally Selective Cannabinoid 1 Receptor (CB1R) Agonists for the Treatment of Neuropathic Pain. J Med Chem 59:7525-43 (2016)  
Target
Name:
Cannabinoid receptor 1
Synonyms:
CANN6 CB-R CNR CNR1_HUMAN Cannabinoid receptor Cannabinoid receptor 1 (brain)
Type:
G Protein-Coupled Receptor (GPCR)
Mol. Mass.:
52868.96
Organism:
Homo sapiens (Human)
Description:
P21554
Residue:
472
  
Inhibitor
Name:
BDBM50534476
Synonyms:
CHEMBL4443660
Type:
Small organic molecule
Emp. Form.:
C29H31NO
Mol. Mass.:
409.5625
SMILES:
CCCc1ccc(\C=C2/C=C(CCN3CCOCC3)c3ccccc23)c2ccccc12
: