Target
Cannabinoid receptor 2
Ligand
BDBM50534497
Substrate
Meas. Tech.
ChEMBL_1929057 (CHEMBL4432233)
Ki
36±n/a nM
Citation
 Seltzman, HHShiner, CHirt, EEGilliam, AFThomas, BFMaitra, RSnyder, RBlack, SLPatel, PRMulpuri, YSpigelman, I Peripherally Selective Cannabinoid 1 Receptor (CB1R) Agonists for the Treatment of Neuropathic Pain. J Med Chem 59:7525-43 (2016)  
Target
Name:
Cannabinoid receptor 2
Synonyms:
CANNABINOID CB2 CB2 CB2B CNR2_HUMAN Cannabinoid CB2 receptor Cannabinoid receptor 2 (CB2R) | hCB2
Type:
G Protein-Coupled Receptor (GPCR)
Mol. Mass.:
39690.94
Organism:
Homo sapiens (Human)
Description:
P34972
Residue:
360
  
Inhibitor
Name:
BDBM50534497
Synonyms:
CHEMBL4438072
Type:
Small organic molecule
Emp. Form.:
C24H22FNO
Mol. Mass.:
359.436
SMILES:
CCCCCn1cc(C(=O)c2cccc3ccccc23)c2c(F)cccc12
: