Target
Cytochrome P450 2C9
Ligand
BDBM50090673
Substrate
Meas. Tech.
ChEMBL_51549 (CHEMBL661223)
Ki
400±n/a nM
Citation
 Rao, SAoyama, RSchrag, MTrager, WFRettie, AJones, JP A refined 3-dimensional QSAR of cytochrome P450 2C9: computational predictions of drug interactions. J Med Chem 43:2789-96 (2000)  
Target
Name:
Cytochrome P450 2C9
Synonyms:
(R)-limonene 6-monooxygenase CP2C9_HUMAN CYP2C9 Cytochrome P450 2C9 (CYP2C9 ) P-450MP P450 PB-1 | S-mephenytoin 4-hydroxylase
Type:
Enzyme
Mol. Mass.:
55636.33
Organism:
Homo sapiens (Human)
Description:
P11712
Residue:
490
  
Inhibitor
Name:
BDBM50090673
Synonyms:
4-Azido-N-(2-phenyl-2H-pyrazol-3-yl)-benzenesulfonamide | CHEMBL94767
Type:
Small organic molecule
Emp. Form.:
C15H12N6O2S
Mol. Mass.:
340.36
SMILES:
[N-]=[N+]=Nc1ccc(cc1)S(=O)(=O)Nc1ccnn1-c1ccccc1
: