Target
Sodium-dependent noradrenaline transporter
Ligand
BDBM82071
Substrate
Meas. Tech.
ChEMBL_1929929 (CHEMBL4433105)
IC50
2550±n/a nM
Citation
 Paudel, SAcharya, SYoon, GKim, KMCheon, SH Exploration of substituted arylpiperazine-tetrazoles as promising dual norepinephrine and dopamine reuptake inhibitors. Bioorg Med Chem 24:5546-5555 (2016)  
Target
Name:
Sodium-dependent noradrenaline transporter
Synonyms:
Monoamine transporter NET Noradrenaline Transporter (NET) Norepinephrine transporter protein (NET) SLC6A2 Sodium-dependent noradrenaline transporter (NET) | Solute carrier family 6 member 2
Type:
Multi-pass membrane protein
Mol. Mass.:
69337.72
Organism:
Homo sapiens (Human)
Description:
P23975
Residue:
617
  
Inhibitor
Name:
BDBM82071
Synonyms:
CAS_93413-69-5 NSC_62923 Venlafaxine hydrochloride WY-45655
Type:
Small organic molecule
Emp. Form.:
C17H27NO2
Mol. Mass.:
277.4018
SMILES:
COc1ccc(cc1)C(CN(C)C)C1(O)CCCCC1
: