Target
Peptide deformylase
Ligand
BDBM50535499
Substrate
Meas. Tech.
ChEMBL_1930890 (CHEMBL4434141)
IC50
6.0±n/a nM
Citation
 Spletstoser, JTDreabit, JKnox, ANBenowitz, ACampobasso, NWard, PCui, GLewandowski, TMcCloskey, LAubart, KM Discovery of piperazic acid peptide deformylase inhibitors with in vivo activity for respiratory tract and skin infections. Bioorg Med Chem Lett 29:2410-2414 (2019)  
Target
Name:
Peptide deformylase
Synonyms:
DEF_STAAM Polypeptide deformylase def1 | pdf1
Type:
Enzyme
Mol. Mass.:
20556.80
Organism:
Staphylococcus aureus
Description:
P68825
Residue:
183
  
Inhibitor
Name:
BDBM50535499
Synonyms:
CHEMBL4437963
Type:
Small organic molecule
Emp. Form.:
C20H34N4O4
Mol. Mass.:
394.5084
SMILES:
ON(C[C@@H](CC1CCCC1)C(=O)N1NCCC[C@H]1C(=O)N1CCCCC1)C=O
: