Target
Androgen receptor
Ligand
BDBM18678
Substrate
Meas. Tech.
ChEMBL_1932232 (CHEMBL4477884)
IC50
490±n/a nM
Citation
 Bassetto, MFerla, SPertusati, FKandil, SWestwell, ADBrancale, AMcGuigan, C Design and synthesis of novel bicalutamide and enzalutamide derivatives as antiproliferative agents for the treatment of prostate cancer. Eur J Med Chem 118:230-43 (2016)  
Target
Name:
Androgen receptor
Synonyms:
ANDR_RAT Ar Nr3c4 | androgen
Type:
Enzyme
Mol. Mass.:
98219.08
Organism:
Rattus norvegicus (Rat)
Description:
P15207
Residue:
902
  
Inhibitor
Name:
BDBM18678
Synonyms:
(2R)-N-[4-cyano-3-(trifluoromethyl)phenyl]-3-[(4-fluorobenzene)sulfonyl]-2-hydroxy-2-methylpropanamide CHEMBL63560 US11230523, Compound R-Bicalutamide US20230382870, (R) Bicalutumide
Type:
Small organic molecule
Emp. Form.:
C18H14F4N2O4S
Mol. Mass.:
430.373
SMILES:
C[C@](O)(CS(=O)(=O)c1ccc(F)cc1)C(=O)Nc1ccc(C#N)c(c1)C(F)(F)F
: