Target
Serine-protein kinase ATM
Ligand
BDBM50459018
Substrate
Meas. Tech.
ChEMBL_1932514 (CHEMBL4478166)
IC50
0.600000±n/a nM
Citation
 Degorce, SLBarlaam, BCadogan, EDishington, ADucray, RGlossop, SCHassall, LALach, FLau, AMcGuire, TMNowak, TOuvry, GPike, KGThomason, AG Discovery of Novel 3-Quinoline Carboxamides as Potent, Selective, and Orally Bioavailable Inhibitors of Ataxia Telangiectasia Mutated (ATM) Kinase. J Med Chem 59:6281-92 (2016)  
Target
Name:
Serine-protein kinase ATM
Synonyms:
A-T mutated ATM_HUMAN | Ataxia telangiectasia mutated
Type:
Protein
Mol. Mass.:
350696.72
Organism:
Homo sapiens (Human)
Description:
Q13315
Residue:
3056
  
Inhibitor
Name:
BDBM50459018
Synonyms:
CHEMBL4166405
Type:
Small organic molecule
Emp. Form.:
C23H23FN6O2
Mol. Mass.:
434.4661
SMILES:
COCc1ccc(cn1)-c1cc2c(N[C@@H](C)c3ccn(C)n3)c(cnc2cc1F)C(N)=O
: