Target
Serine-protein kinase ATM
Ligand
BDBM50535970
Substrate
Meas. Tech.
ChEMBL_1932514 (CHEMBL4478166)
IC50
0.800000±n/a nM
Citation
 Degorce, SLBarlaam, BCadogan, EDishington, ADucray, RGlossop, SCHassall, LALach, FLau, AMcGuire, TMNowak, TOuvry, GPike, KGThomason, AG Discovery of Novel 3-Quinoline Carboxamides as Potent, Selective, and Orally Bioavailable Inhibitors of Ataxia Telangiectasia Mutated (ATM) Kinase. J Med Chem 59:6281-92 (2016)  
Target
Name:
Serine-protein kinase ATM
Synonyms:
A-T mutated ATM_HUMAN | Ataxia telangiectasia mutated
Type:
Protein
Mol. Mass.:
350696.72
Organism:
Homo sapiens (Human)
Description:
Q13315
Residue:
3056
  
Inhibitor
Name:
BDBM50535970
Synonyms:
CHEMBL4569967
Type:
Small organic molecule
Emp. Form.:
C22H19NO3S
Mol. Mass.:
377.456
SMILES:
O=c1cc(oc(c1)-c1cccc2Cc3ccccc3Sc12)N1CCOCC1
: