Target
Proteasome subunit beta type-5
Ligand
BDBM50536438
Substrate
Meas. Tech.
ChEMBL_1933756 (CHEMBL4479408)
IC50
2.0±n/a nM
Citation
 Xin, BTde Bruin, GHuber, EMBesse, AFlorea, BIFilippov, DVvan der Marel, GAKisselev, AFvan der Stelt, MDriessen, CGroll, MOverkleeft, HS Structure-Based Design of ?5c Selective Inhibitors of Human Constitutive Proteasomes. J Med Chem 59:7177-87 (2016)  
Target
Name:
Proteasome subunit beta type-5
Synonyms:
20S proteasome chymotrypsin-like LMPX PSB5_HUMAN Proteasome Macropain subunit MB1 X
Type:
Protein
Mol. Mass.:
28480.96
Organism:
Homo sapiens (Human)
Description:
Residue:
263
  
Inhibitor
Name:
BDBM50536438
Synonyms:
CHEMBL4534488
Type:
Small organic molecule
Emp. Form.:
C37H50N6O5
Mol. Mass.:
658.8301
SMILES:
CC(C)C[C@H](NC(=O)[C@H](Cc1ccccc1)NC(=O)[C@H](CC1CCC(C)CC1)NC(=O)[C@H](Cc1ccccc1)N=[N+]=[N-])C(=O)[C@@]1(C)CO1
: