Target
Proteasome subunit beta type-2
Ligand
BDBM50536431
Substrate
Meas. Tech.
ChEMBL_1933761 (CHEMBL4479413)
IC50
46±n/a nM
Citation
 Xin, BTde Bruin, GHuber, EMBesse, AFlorea, BIFilippov, DVvan der Marel, GAKisselev, AFvan der Stelt, MDriessen, CGroll, MOverkleeft, HS Structure-Based Design of ?5c Selective Inhibitors of Human Constitutive Proteasomes. J Med Chem 59:7177-87 (2016)  
Target
Name:
Proteasome subunit beta type-2
Synonyms:
20S proteasome PSMB2 | Proteasome Macropain subunit
Type:
PROTEIN
Mol. Mass.:
22837.53
Organism:
Homo sapiens (Human)
Description:
ChEMBL_1294233
Residue:
201
  
Inhibitor
Name:
BDBM50536431
Synonyms:
CHEMBL4519899
Type:
Small organic molecule
Emp. Form.:
C37H44N6O5
Mol. Mass.:
652.7825
SMILES:
CC(C)C[C@H](NC(=O)[C@H](Cc1ccccc1)NC(=O)[C@H](CCc1ccccc1)NC(=O)[C@H](Cc1ccccc1)N=[N+]=[N-])C(=O)[C@@]1(C)CO1
: