Target
Histone-lysine N-methyltransferase SETD7
Ligand
BDBM50009672
Substrate
Meas. Tech.
ChEMBL_1933905 (CHEMBL4479557)
IC50
47000±n/a nM
Citation
 Spurr, SSBayle, EDYu, WLi, FTempel, WVedadi, MSchapira, MFish, PV New small molecule inhibitors of histone methyl transferase DOT1L with a nitrile as a non-traditional replacement for heavy halogen atoms. Bioorg Med Chem Lett 26:4518-4522 (2016)  
Target
Name:
Histone-lysine N-methyltransferase SETD7
Synonyms:
Histone-lysine N-methyltransferase SETD7 KMT7 SET7 SETD7 | SETD7_HUMAN
Type:
Enzyme
Mol. Mass.:
40691.12
Organism:
Homo sapiens (Human)
Description:
Q8WTS6
Residue:
366
  
Inhibitor
Name:
BDBM50009672
Synonyms:
AdoHcy S-(5'-adenosyl)-L-homocysteine S-[1-(adenin-9-yl)-1,5-dideoxy-beta-D-ribofuranos-5-yl]-L-homocysteine SAH US9175331, 1 | US9333217, S-Adenosyl-L-homocysteine (SAH)
Type:
Small organic molecule
Emp. Form.:
C14H20N6O5S
Mol. Mass.:
384.411
SMILES:
N[C@@H](CCSC[C@H]1O[C@H]([C@H](O)[C@@H]1O)n1cnc2c(N)ncnc12)C(O)=O
: