Target
cAMP-specific 3',5'-cyclic phosphodiesterase 4A
Ligand
BDBM50092626
Substrate
Meas. Tech.
ChEMBL_155660 (CHEMBL763044)
IC50
0.4±n/a nM
Citation
 Macdonald, DPerrier, HLiu, SLaliberté, FRasori, RRobichaud, AMasson, PHuang, Z Hunting the emesis and efficacy targets of PDE4 inhibitors: identification of the photoaffinity probe 8-(3-azidophenyl)-6- [(4-iodo-1H-1-imidazolyl)methyl]quinoline (APIIMQ). J Med Chem 43:3820-3 (2000)  
Target
Name:
cAMP-specific 3',5'-cyclic phosphodiesterase 4A
Synonyms:
3',5'-cyclic phosphodiesterase PDE46 PDE4A_HUMAN Phosphodiesterase 4A | Phosphodiesterase 4A (PDE4)
Type:
Enzyme
Mol. Mass.:
98113.27
Organism:
Homo sapiens (Human)
Description:
P27815
Residue:
886
  
Inhibitor
Name:
BDBM50092626
Synonyms:
8-(3-Azido-phenyl)-6-(4-iodo-imidazol-1-ylmethyl)-quinoline | CHEMBL419236
Type:
Small organic molecule
Emp. Form.:
C19H13IN6
Mol. Mass.:
452.2512
SMILES:
Ic1cn(Cc2cc(-c3cccc(c3)N=[N+]=[N-])c3ncccc3c2)cn1
: