Target
Dipeptidyl peptidase 4
Ligand
BDBM420962
Substrate
Meas. Tech.
ChEMBL_1935334 (CHEMBL4481093)
Kd
0.177±n/a nM
Citation
 Li, SQin, CCui, SXu, HWu, FWang, JSu, MFang, XLi, DJiao, QZhang, MXia, CZhu, LWang, RLi, JJiang, HZhao, ZLi, JLi, H Discovery of a Natural-Product-Derived Preclinical Candidate for Once-Weekly Treatment of Type 2 Diabetes. J Med Chem 62:2348-2361 (2019)  
Target
Name:
Dipeptidyl peptidase 4
Synonyms:
ADABP Adenosine deaminase complexing protein 2 CD_antigen=CD26 DPP4 DPPIV Dipeptidyl peptidase 4 (DPP IV) Dipeptidyl peptidase 4 (DPP4) Dipeptidyl peptidase 4 membrane form Dipeptidyl peptidase IV Dipeptidyl peptidase IV (DDP-IV) Dipeptidyl peptidase IV membrane form Dipeptidyl peptidase-IV (DPP-4) T-cell activation antigen CD26 | TP103
Type:
Enzyme
Mol. Mass.:
88271.01
Organism:
Homo sapiens (Human)
Description:
P27487
Residue:
766
  
Inhibitor
Name:
BDBM420962
Synonyms:
US10479798, Compound 21
Type:
Small organic molecule
Emp. Form.:
C21H15F3N2O2
Mol. Mass.:
384.3512
SMILES:
COc1cc2c3C[C@H](N)[C@H](Oc3ccc2cc1C#N)c1cc(F)c(F)cc1F
: