Target
Muscarinic acetylcholine receptor M2
Ligand
BDBM50092959
Substrate
Meas. Tech.
ChEBML_139765
Ki
0.110000±n/a nM
Citation
 Wang, YChackalamannil, SHu, ZClader, JWGreenlee, WBillard, WBinch, HCrosby, GRuperto, VDuffy, RAMcQuade, RLachowicz, JE Design and synthesis of piperidinyl piperidine analogues as potent and selective M2 muscarinic receptor antagonists. Bioorg Med Chem Lett 10:2247-50 (2001)  
Target
Name:
Muscarinic acetylcholine receptor M2
Synonyms:
ACM2_HUMAN Cholinergic, muscarinic M2 Muscarinic acetylcholine receptor M2 and M5 | RecName: Full=Muscarinic acetylcholine receptor M2
Type:
GPCR
Mol. Mass.:
51730.61
Organism:
Homo sapiens (Human)
Description:
P08172
Residue:
466
  
Inhibitor
Name:
BDBM50092959
Synonyms:
4-{1-[4-(4-Methoxy-benzenesulfonyl)-phenyl]-vinyl}-[1,4']bipiperidinyl-1'-carboxylic acid ethyl ester ethyl 4-(4-(1-(4-(4-methoxyphenylsulfonyl)phenyl)vinyl)piperidin-1-yl)piperidine-1-carboxylate
Type:
Small organic molecule
Emp. Form.:
C28H36N2O5S
Mol. Mass.:
512.661
SMILES:
CCOC(=O)N1CCC(CC1)N1CCC(CC1)C(=C)c1ccc(cc1)S(=O)(=O)c1ccc(OC)cc1
: