Target
Somatostatin receptor type 2
Ligand
BDBM50096819
Substrate
Meas. Tech.
ChEBML_200365
Ki
11±n/a nM
Citation
 Zhou, CGuo, LMorriello, GPasternak, APan, YRohrer, SPBirzin, ETHuskey, SEJacks, TSchleim, KDCheng, KSchaeffer, JMPatchett, AAYang, L Nipecotic and iso-nipecotic amides as potent and selective somatostatin subtype-2 receptor agonists. Bioorg Med Chem Lett 11:415-7 (2001)  
Target
Name:
Somatostatin receptor type 2
Synonyms:
SOMATOSTATIN SST2 SS-2-R SS2R SSTR2 | Somatostatin receptor type 2 (SSTR2)
Type:
Enzyme
Mol. Mass.:
41344.94
Organism:
Homo sapiens (Human)
Description:
P30874
Residue:
369
  
Inhibitor
Name:
BDBM50096819
Synonyms:
3-{3-[(S)-1-((S)-5-Amino-1-tert-butoxycarbonyl-pentylcarbamoyl)-2-(1H-indol-3-yl)-propylcarbamoyl]-piperidin-1-ylmethyl}-benzoic acid methyl ester | CHEMBL263023
Type:
Small organic molecule
Emp. Form.:
C37H51N5O6
Mol. Mass.:
661.8307
SMILES:
COC(=O)c1cccc(CN2CCCC(C2)C(=O)NC([C@@H](C)c2c[nH]c3ccccc23)C(=O)N[C@@H](CCCCN)C(=O)OC(C)(C)C)c1
: