Target
Somatostatin receptor type 2
Ligand
BDBM50096825
Substrate
Meas. Tech.
ChEMBL_200365 (CHEMBL805713)
Ki
15±n/a nM
Citation
 Zhou, CGuo, LMorriello, GPasternak, APan, YRohrer, SPBirzin, ETHuskey, SEJacks, TSchleim, KDCheng, KSchaeffer, JMPatchett, AAYang, L Nipecotic and iso-nipecotic amides as potent and selective somatostatin subtype-2 receptor agonists. Bioorg Med Chem Lett 11:415-7 (2001)  
Target
Name:
Somatostatin receptor type 2
Synonyms:
SOMATOSTATIN SST2 SS-2-R SS2R SSTR2 | Somatostatin receptor type 2 (SSTR2)
Type:
Enzyme
Mol. Mass.:
41344.94
Organism:
Homo sapiens (Human)
Description:
P30874
Residue:
369
  
Inhibitor
Name:
BDBM50096825
Synonyms:
(S)-6-Amino-2-{(S)-3-(1H-indol-3-yl)-2-[(1-isobutyryl-piperidine-4-carbonyl)-amino]-butyrylamino}-hexanoic acid tert-butyl ester | CHEMBL335223
Type:
Small organic molecule
Emp. Form.:
C32H49N5O5
Mol. Mass.:
583.762
SMILES:
CC(C)C(=O)N1CCC(CC1)C(=O)NC([C@@H](C)c1c[nH]c2ccccc12)C(=O)N[C@@H](CCCCN)C(=O)OC(C)(C)C
: