Target
Bifunctional glutamate/proline--tRNA ligase
Ligand
BDBM50097092
Substrate
Meas. Tech.
ChEBML_223472
IC50
>100000±n/a nM
Citation
 Yu, XYHill, JMYu, GYang, YKluge, AFKeith, DFinn, JGallant, PSilverman, JLim, A A series of quinoline analogues as potent inhibitors of C. albicans prolyl tRNA synthetase. Bioorg Med Chem Lett 11:541-4 (2001)  
Target
Name:
Bifunctional glutamate/proline--tRNA ligase
Synonyms:
Aminoacyl-tRNA synthetase EPRS GLNS Glutamyl-tRNA synthetase Proliferation-inducing gene 32 protein QARS SYEP_HUMAN
Type:
PROTEIN
Mol. Mass.:
170602.50
Organism:
Homo sapiens (Human)
Description:
ChEMBL_223474
Residue:
1512
  
Inhibitor
Name:
BDBM50097092
Synonyms:
2-{[2-(4-Bromo-phenyl)-6-chloro-8-methyl-quinoline-4-carbonyl]-amino}-3-phenyl-propionic acid methyl ester | CHEMBL434852
Type:
Small organic molecule
Emp. Form.:
C27H22BrClN2O3
Mol. Mass.:
537.832
SMILES:
COC(=O)C(Cc1ccccc1)NC(=O)c1cc(nc2c(C)cc(Cl)cc12)-c1ccc(Br)cc1
: