Target
Serine/threonine-protein kinase LMTK3
Ligand
BDBM50542348
Substrate
Meas. Tech.
ChEMBL_1986602 (CHEMBL4620149)
IC50
226±n/a nM
Citation
 Ortiz, MAMichaels, HMolina, BToenjes, SDavis, JMarconi, GDHecht, DGustafson, JLPiedrafita, FJNefzi, A Discovery of cyclic guanidine-linked sulfonamides as inhibitors of LMTK3 kinase. Bioorg Med Chem Lett 30:0 (2020)  
Target
Name:
Serine/threonine-protein kinase LMTK3
Synonyms:
2.7.11.1 LMTK3 Lemur tyrosine kinase 3 TYKLM3
Type:
PROTEIN
Mol. Mass.:
153597.90
Organism:
Homo sapiens
Description:
ChEMBL_119182
Residue:
1460
  
Inhibitor
Name:
BDBM50542348
Synonyms:
CHEMBL4647760
Type:
Small organic molecule
Emp. Form.:
C25H33ClN4O3S
Mol. Mass.:
505.073
SMILES:
Oc1ccc(C[C@@H](CN2[C@@H](CC3CCCCC3)CNC2=N)NS(=O)(=O)c2ccccc2Cl)cc1
: