Target
Estrogen receptor
Ligand
BDBM19441
Substrate
Meas. Tech.
ChEMBL_67173 (CHEMBL681157)
IC50
4±n/a nM
Citation
 Miller, CPCollini, MDTran, BDHarris, HAKharode, YPMarzolf, JTMoran, RAHenderson, RABender, RHUnwalla, RJGreenberger, LMYardley, JPAbou-Gharbia, MALyttle, CRKomm, BS Design, synthesis, and preclinical characterization of novel, highly selective indole estrogens. J Med Chem 44:1654-7 (2001)  
Target
Name:
Estrogen receptor
Synonyms:
ER ESR ESR1_HUMAN Estrogen receptor Estrogen receptor (ER-alpha) Estrogen receptor alpha (ER) Nuclear receptor subfamily 3 group A member 1
Type:
Protein
Mol. Mass.:
66230.44
Organism:
Homo sapiens (Human)
Description:
P03372
Residue:
595
  
Inhibitor
Name:
BDBM19441
Synonyms:
2-(4-hydroxyphenyl)-3-({4-[2-(piperidin-1-yl)ethoxy]phenyl}carbonyl)-1-benzothiophen-6-ol Evista RALOXIFENE HYDROCHLORIDE Raloxifene (7) [6-hydroxy-2-(4-hydroxyphenyl)-1-benzothiophen-3-yl]-[4-(2-piperidin-1-ylethoxy)phenyl]methanone | cid_11071264
Type:
Small organic molecule
Emp. Form.:
C28H27NO4S
Mol. Mass.:
473.583
SMILES:
Oc1ccc(cc1)-c1sc2cc(O)ccc2c1C(=O)c1ccc(OCCN2CCCCC2)cc1
: