Target
Androgen receptor
Ligand
BDBM18699
Substrate
Meas. Tech.
ChEMBL_36137 (CHEMBL648326)
Ki
0.3±n/a nM
Citation
 Marhefka, CAMoore, BMBishop, TCKirkovsky, LMukherjee, ADalton, JTMiller, DD Homology modeling using multiple molecular dynamics simulations and docking studies of the human androgen receptor ligand binding domain bound to testosterone and nonsteroidal ligands. J Med Chem 44:1729-40 (2001)  
Target
Name:
Androgen receptor
Synonyms:
ANDR_HUMAN Androgen Receptor Androgen receptor/Baculoviral IAP repeat-containing protein 2 Dihydrotestosterone receptor Nuclear receptor subfamily 3 group C member 4
Type:
Receptor
Mol. Mass.:
99185.27
Organism:
Homo sapiens (Human)
Description:
CHO cells were stably transfected with human AR gene.
Residue:
920
  
Inhibitor
Name:
BDBM18699
Synonyms:
(2R)-3-bromo-2-hydroxy-2-methyl-N-[4-nitro-3-(trifluoromethyl)phenyl]propanamide R-3
Type:
Small organic molecule
Emp. Form.:
C11H10BrF3N2O4
Mol. Mass.:
371.107
SMILES:
C[C@](O)(CBr)C(=O)Nc1ccc(c(c1)C(F)(F)F)[N+]([O-])=O
: