Target
Receptor-type tyrosine-protein phosphatase C
Ligand
BDBM50099693
Substrate
Meas. Tech.
ChEMBL_39938 (CHEMBL655779)
IC50
800±n/a nM
Citation
 Urbanek, RASuchard, SJSteelman, GBKnappenberger, KSSygowski, LAVeale, CAChapdelaine, MJ Potent reversible inhibitors of the protein tyrosine phosphatase CD45. J Med Chem 44:1777-93 (2001)  
Target
Name:
Receptor-type tyrosine-protein phosphatase C
Synonyms:
CD45 L-CA PTPRC Receptor-type tyrosine-protein phosphatase C (CD45) | T200
Type:
Protein
Mol. Mass.:
147474.19
Organism:
Homo sapiens (Human)
Description:
P08575
Residue:
1306
  
Inhibitor
Name:
BDBM50099693
Synonyms:
5-{2-[1-(Carboxymethyl-carbamoyl)-4-guanidino-butylcarbamoyl]-pyrrolidin-1-yl}-4-{2-[(9,10-dioxo-9,10-dihydro-phenanthrene-2-carbonyl)-amino]-acetylamino}-5-oxo-pentanoic acid | CHEMBL51782
Type:
Small organic molecule
Emp. Form.:
C35H40N8O11
Mol. Mass.:
748.7391
SMILES:
NC(=N)NCCCC(NC(=O)C1CCCN1C(=O)C(CCC(O)=O)NC(=O)CNC(=O)c1ccc2-c3ccccc3C(=O)C(=O)c2c1)C(=O)NCC(O)=O
: