Target
Receptor-type tyrosine-protein phosphatase C
Ligand
BDBM50099749
Substrate
Meas. Tech.
ChEMBL_39938 (CHEMBL655779)
IC50
700±n/a nM
Citation
 Urbanek, RASuchard, SJSteelman, GBKnappenberger, KSSygowski, LAVeale, CAChapdelaine, MJ Potent reversible inhibitors of the protein tyrosine phosphatase CD45. J Med Chem 44:1777-93 (2001)  
Target
Name:
Receptor-type tyrosine-protein phosphatase C
Synonyms:
CD45 L-CA PTPRC Receptor-type tyrosine-protein phosphatase C (CD45) | T200
Type:
Protein
Mol. Mass.:
147474.19
Organism:
Homo sapiens (Human)
Description:
P08575
Residue:
1306
  
Inhibitor
Name:
BDBM50099749
Synonyms:
5-{2-[3-Carbamoyl-1-(carboxymethyl-carbamoyl)-propylcarbamoyl]-pyrrolidin-1-yl}-4-{2-[(9,10-dioxo-9,10-dihydro-phenanthrene-2-carbonyl)-amino]-acetylamino}-5-oxo-pentanoic acid | CHEMBL300001
Type:
Small organic molecule
Emp. Form.:
C34H36N6O12
Mol. Mass.:
720.6826
SMILES:
NC(=O)CCC(NC(=O)C1CCCN1C(=O)C(CCC(O)=O)NC(=O)CNC(=O)c1ccc-2c(c1)C(=O)C(=O)c1ccccc-21)C(=O)NCC(O)=O
: