Target
Receptor-type tyrosine-protein phosphatase C
Ligand
BDBM50099700
Substrate
Meas. Tech.
ChEMBL_40064 (CHEMBL855015)
IC50
300±n/a nM
Citation
 Urbanek, RASuchard, SJSteelman, GBKnappenberger, KSSygowski, LAVeale, CAChapdelaine, MJ Potent reversible inhibitors of the protein tyrosine phosphatase CD45. J Med Chem 44:1777-93 (2001)  
Target
Name:
Receptor-type tyrosine-protein phosphatase C
Synonyms:
CD45 L-CA PTPRC Receptor-type tyrosine-protein phosphatase C (CD45) | T200
Type:
Protein
Mol. Mass.:
147474.19
Organism:
Homo sapiens (Human)
Description:
P08575
Residue:
1306
  
Inhibitor
Name:
BDBM50099700
Synonyms:
CHEMBL51776 | N-[7-(3-Methoxycarbonyl-propionylamino)-9,10-dioxo-9,10-dihydro-phenanthren-2-yl]-succinamic acid methyl ester
Type:
Small organic molecule
Emp. Form.:
C24H22N2O8
Mol. Mass.:
466.4401
SMILES:
COC(=O)CCC(=O)Nc1ccc-2c(c1)C(=O)C(=O)c1cc(NC(=O)CCC(=O)OC)ccc-21
: