Target
D(3) dopamine receptor
Ligand
BDBM50099821
Substrate
Meas. Tech.
ChEMBL_62749 (CHEMBL674590)
Ki
0.04±n/a nM
Citation
 Huang, YLuedtke, RRFreeman, RAWu, LMach, RH Synthesis and structure-activity relationships of naphthamides as dopamine D3 receptor ligands. J Med Chem 44:1815-26 (2001)  
Target
Name:
D(3) dopamine receptor
Synonyms:
DOPAMINE D3 Dopamine D3 receptor | Drd3
Type:
Protein
Mol. Mass.:
49540.58
Organism:
Rattus norvegicus (Rat)
Description:
P19020
Residue:
446
  
Inhibitor
Name:
BDBM50099821
Synonyms:
4-Bromo-1-methoxy-naphthalene-2-carboxylic acid (9-benzyl-9-aza-bicyclo[3.3.1]non-3-yl)-amide | CHEMBL52588
Type:
Small organic molecule
Emp. Form.:
C27H29BrN2O2
Mol. Mass.:
493.435
SMILES:
COc1c(cc(Br)c2ccccc12)C(=O)NC1CC2CCCC(C1)N2Cc1ccccc1
: