Target
Gag-Pol polyprotein [489-587]
Ligand
BDBM8125
Substrate
Meas. Tech.
ChEMBL_1992189 (CHEMBL4625924)
IC50
2.9±n/a nM
Citation
 Zhu, MMa, LDong, BZhang, GWang, JZhou, JCen, SWang, Y Design and biological evaluation of novel HIV-1 protease inhibitors with isopropanol as P1' ligand to enhance binding with S1' subsite. Bioorg Med Chem 28:0 (2020)  
Target
Name:
Gag-Pol polyprotein [489-587]
Synonyms:
Human immunodeficiency virus type 1 protease Pol polyprotein | gag-pol
Type:
Enzyme Subunit
Mol. Mass.:
10781.16
Organism:
Human immunodeficiency virus type 1
Description:
P04585[489-587]
Residue:
99
  
Inhibitor
Name:
BDBM8125
Synonyms:
(3R,3aS,6aR)-hexahydrofuro[2,3-b]furan-3-yl N-[(2S,3R)-4-[(4-aminobenzene)(2-methylpropyl)sulfonamido]-3-hydroxy-1-phenylbutan-2-yl]carbamate Darunavir TMC-114 US10806794, Compound Darunavir
Type:
Small organic molecule
Emp. Form.:
C27H37N3O7S
Mol. Mass.:
547.664
SMILES:
[H][C@@]1(CO[C@@]2([H])OCC[C@@]12[H])OC(=O)N[C@@H](Cc1ccccc1)[C@H](O)CN(CC(C)C)S(=O)(=O)c1ccc(N)cc1
: