Target
Prostaglandin E2 receptor EP2 subtype
Ligand
BDBM50101853
Substrate
Meas. Tech.
ChEMBL_158311 (CHEMBL763368)
Ki
41±n/a nM
Citation
 Maruyama, TAsada, MShiraishi, TSakata, KSeki, AYoshida, HShinagawa, YMaruyama, TOhuchida, SNakai, HKondo, KToda, M Design and synthesis of a highly selective EP4-receptor agonist. Part 2: 5-thia and 9beta-haloPG derivatives with improved stability. Bioorg Med Chem Lett 11:2033-5 (2001)  
Target
Name:
Prostaglandin E2 receptor EP2 subtype
Synonyms:
PE2R2_MOUSE Prostaglandin E2 Prostanoid EP2 receptor Ptgerep2
Type:
G-protein coupled receptor
Mol. Mass.:
40495.26
Organism:
Mus musculus (Mouse)
Description:
Residue:
362
  
Inhibitor
Name:
BDBM50101853
Synonyms:
(11alpha,13E,15S)-11,15-dihydroxy-9-oxoprost-13-en-1-oic acid 11alpha,15alpha-dihydroxy-9-oxo-13-trans-prostenoic acid CHEMBL495 PGE1 | prostaglandin E1
Type:
Small organic molecule
Emp. Form.:
C20H34O5
Mol. Mass.:
354.481
SMILES:
CCCCC[C@H](O)\C=C\[C@H]1[C@H](O)CC(=O)[C@@H]1CCCCCCC(O)=O
: