Target
Coagulation factor X
Ligand
BDBM50101872
Substrate
Meas. Tech.
ChEBML_48813
Ki
1200±n/a nM
Citation
 Rai, RKolesnikov, ALi, YYoung, WBLeahy, ESprengeler, PAVerner, EShrader, WDBurgess-Henry, JSangalang, JCAllen, DChen, XKatz, BALuong, CElrod, KCregar, L Development of potent and selective factor Xa inhibitors. Bioorg Med Chem Lett 11:1797-800 (2001)  
Target
Name:
Coagulation factor X
Synonyms:
Activated coagulation factor X (FXa) Coagulation factor X precursor F10 Factor X heavy chain Factor Xa Stuart-Prower factor
Type:
Enzyme
Mol. Mass.:
54726.60
Organism:
Homo sapiens (Human)
Description:
Residue:
488
  
Inhibitor
Name:
BDBM50101872
Synonyms:
2-(2-Hydroxy-3,5-dimethyl-phenyl)-1H-indole-5-carboxamidine | CHEMBL54093
Type:
Small organic molecule
Emp. Form.:
C17H17N3O
Mol. Mass.:
279.3364
SMILES:
Cc1cc(C)c(O)c(c1)-c1cc2cc(ccc2[nH]1)C(N)=N
: