Target
Coagulation factor X
Ligand
BDBM50102780
Substrate
Meas. Tech.
ChEMBL_48667 (CHEMBL658338)
Ki
78±n/a nM
Citation
 Verner, EKatz, BASpencer, JRAllen, DHataye, JHruzewicz, WHui, HCKolesnikov, ALi, YLuong, CMartelli, ARadika, KRai, RShe, MShrader, WSprengeler, PATrapp, SWang, JYoung, WBMackman, RL Development of serine protease inhibitors displaying a multicentered short (<2.3 A) hydrogen bond binding mode: inhibitors of urokinase-type plasminogen activator and factor Xa. J Med Chem 44:2753-71 (2001)  
Target
Name:
Coagulation factor X
Synonyms:
Activated coagulation factor X (FXa) Coagulation factor X precursor F10 Factor X heavy chain Factor Xa Stuart-Prower factor
Type:
Enzyme
Mol. Mass.:
54726.60
Organism:
Homo sapiens (Human)
Description:
Residue:
488
  
Inhibitor
Name:
BDBM50102780
Synonyms:
2-(2-Hydroxy-3-phenyl-phenyl)-1H-indole-5-carboxamidine 3-{5-[AMINO(IMINIO)METHYL]-1H-INDOL-2-YL}-1,1'-BIPHENYL-2-OLATE | CHEMBL96433
Type:
Small organic molecule
Emp. Form.:
C21H17N3O
Mol. Mass.:
327.3792
SMILES:
NC(=N)c1ccc2[nH]c(cc2c1)-c1cccc(-c2ccccc2)c1O
: