Target
Coagulation factor VII/Tissue factor
Ligand
BDBM50103655
Substrate
Meas. Tech.
ChEMBL_69535 (CHEMBL680624)
Ki
3±n/a nM
Citation
 Young, WBKolesnikov, ARai, RSprengeler, PALeahy, EMShrader, WDSangalang, JBurgess-Henry, JSpencer, JElrod, KCregar, L Optimization of a screening lead for factor VIIa/TF. Bioorg Med Chem Lett 11:2253-6 (2001)  
Target
Name:
Coagulation factor VII/Tissue factor
Synonyms:
Coagulation factor III/Factor VIIa (fVIIa) | Coagulation factor III/VII
Type:
Mol. Mass.:
Description:
ASSAY_ID of EBI is 69535
Components:
This complex has 2 components.
Component 1
Name:
Tissue factor
Synonyms:
CD_antigen=CD142 Coagulation factor VII/tissue factor TF Thromboplastin | Tissue factor
Type:
PROTEIN
Mol. Mass.:
33067.61
Organism:
Homo sapiens (Human)
Description:
ChEMBL_936735
Residue:
295
  
Component 2
Name:
Coagulation factor VII
Synonyms:
Eptacog alfa FA7_HUMAN Factor VIIa (fVIIa) SPCA serum prothrombin conversion accelerator
Type:
Enzyme
Mol. Mass.:
51599.89
Organism:
Homo sapiens (Human)
Description:
Residue:
466
  
Inhibitor
Name:
BDBM50103655
Synonyms:
CHEMBL72231 | Phosphoric acid mono-{2-[5-(5-carbamimidoyl-1H-indol-2-yl)-6-hydroxy-3'-nitro-biphenyl-3-yl]-ethyl} ester
Type:
Small organic molecule
Emp. Form.:
C23H21N4O7P
Mol. Mass.:
496.4092
SMILES:
NC(=N)c1ccc2[nH]c(cc2c1)-c1cc(CCO[P+](O)(O)[O-])cc(c1O)-c1cccc(c1)[N+]([O-])=O
: