Target
Matrix metalloproteinase-9
Ligand
BDBM50104002
Substrate
Meas. Tech.
ChEMBL_105230 (CHEMBL712561)
IC50
0.200000±n/a nM
Citation
 Hanessian, SMoitessier, NGauchet, CViau, M N-Aryl sulfonyl homocysteine hydroxamate inhibitors of matrix metalloproteinases: further probing of the S(1), S(1)', and S(2)' pockets. J Med Chem 44:3066-73 (2001)  
Target
Name:
Matrix metalloproteinase-9
Synonyms:
67 kDa matrix metalloproteinase-9 92 kDa gelatinase CLG4B Gelatinase B MMP9 Matrix metalloproteinase 9 (MMP-9) Matrix metalloproteinase-9 (MMP9)
Type:
Enzyme
Mol. Mass.:
78452.28
Organism:
Homo sapiens (Human)
Description:
P14780
Residue:
707
  
Inhibitor
Name:
BDBM50104002
Synonyms:
4-Benzylsulfanyl-2-[cyclohexylcarbamoylmethyl-(4-methoxy-benzenesulfonyl)-amino]-N-hydroxy-butyramide | CHEMBL102785
Type:
Small organic molecule
Emp. Form.:
C26H35N3O6S2
Mol. Mass.:
549.703
SMILES:
COc1ccc(cc1)S(=O)(=O)N(CC(=O)NC1CCCCC1)C(CCSCc1ccccc1)C(=O)NO
: