Target
Matrix metalloproteinase-9
Ligand
BDBM50103996
Substrate
Meas. Tech.
ChEMBL_105230 (CHEMBL712561)
IC50
0.200000±n/a nM
Citation
 Hanessian, SMoitessier, NGauchet, CViau, M N-Aryl sulfonyl homocysteine hydroxamate inhibitors of matrix metalloproteinases: further probing of the S(1), S(1)', and S(2)' pockets. J Med Chem 44:3066-73 (2001)  
Target
Name:
Matrix metalloproteinase-9
Synonyms:
67 kDa matrix metalloproteinase-9 92 kDa gelatinase CLG4B Gelatinase B MMP9 Matrix metalloproteinase 9 (MMP-9) Matrix metalloproteinase-9 (MMP9)
Type:
Enzyme
Mol. Mass.:
78452.28
Organism:
Homo sapiens (Human)
Description:
P14780
Residue:
707
  
Inhibitor
Name:
BDBM50103996
Synonyms:
4-(4-Cyclohex-2-enyl-benzylsulfanyl)-N-hydroxy-2-[isobutyl-(4-methoxy-benzenesulfonyl)-amino]-butyramide | CHEMBL102504
Type:
Small organic molecule
Emp. Form.:
C28H38N2O5S2
Mol. Mass.:
546.742
SMILES:
COc1ccc(cc1)S(=O)(=O)N(CC(C)C)C(CCSCc1ccc(cc1)C1CCCC=C1)C(=O)NO
: