Target
Stromelysin-1
Ligand
BDBM50104001
Substrate
Meas. Tech.
ChEMBL_104709 (CHEMBL709522)
IC50
0.700000±n/a nM
Citation
 Hanessian, SMoitessier, NGauchet, CViau, M N-Aryl sulfonyl homocysteine hydroxamate inhibitors of matrix metalloproteinases: further probing of the S(1), S(1)', and S(2)' pockets. J Med Chem 44:3066-73 (2001)  
Target
Name:
Stromelysin-1
Synonyms:
MMP-3 MMP3_HUMAN Matrix metalloproteinase 3 Matrix metalloproteinase-3 (MMP-3) SL-1 Stromelysin 1 | Transin-1
Type:
Enzyme
Mol. Mass.:
53973.13
Organism:
Homo sapiens (Human)
Description:
P08254
Residue:
477
  
Inhibitor
Name:
BDBM50104001
Synonyms:
4-(benzylthio)-N-hydroxy-2-(N-isobutyl-4-methoxyphenylsulfonamido)butanamide CHEMBL104022
Type:
Small organic molecule
Emp. Form.:
C22H30N2O5S2
Mol. Mass.:
466.614
SMILES:
COc1ccc(cc1)S(=O)(=O)N(CC(C)C)C(CCSCc1ccccc1)C(=O)NO
: