Target
Potassium voltage-gated channel subfamily KQT member 1
Ligand
BDBM50106174
Substrate
Meas. Tech.
ChEMBL_158397 (CHEMBL767061)
IC50
>3000±n/a nM
Citation
 Lloyd, JSchmidt, JBRovnyak, GAhmad, SAtwal, KSBisaha, SNDoweyko, LMStein, PDTraeger, SCMathur, AConder, MLDiMarco, JHarper, TWJenkins-West, TLevesque, PCNormandin, DERussell, ADSerafino, RPSmith, MALodge, NJ Design and synthesis of 4-substituted benzamides as potent, selective, and orally bioavailable I(Ks) blockers. J Med Chem 44:3764-7 (2001)  
Target
Name:
Potassium voltage-gated channel subfamily KQT member 1
Synonyms:
IKs producing slow voltage-gated potassium channel subunit alpha KvLQT1 KCNQ1_CAVPO KVLQT1 Voltage-gated potassium channel subunit Kv7.1
Type:
PROTEIN
Mol. Mass.:
74450.11
Organism:
Cavia porcellus
Description:
ChEMBL_88894
Residue:
671
  
Inhibitor
Name:
BDBM50106174
Synonyms:
CHEMBL332297 | N-(2,2-Dimethyl-cyclohexylmethyl)-4-hexyloxy-benzamide
Type:
Small organic molecule
Emp. Form.:
C22H35NO2
Mol. Mass.:
345.5188
SMILES:
CCCCCCOc1ccc(cc1)C(=O)NCC1CCCCC1(C)C
: