Target
Potassium voltage-gated channel subfamily KQT member 1
Ligand
BDBM50061218
Substrate
Meas. Tech.
ChEMBL_158397 (CHEMBL767061)
IC50
31±n/a nM
Citation
 Lloyd, JSchmidt, JBRovnyak, GAhmad, SAtwal, KSBisaha, SNDoweyko, LMStein, PDTraeger, SCMathur, AConder, MLDiMarco, JHarper, TWJenkins-West, TLevesque, PCNormandin, DERussell, ADSerafino, RPSmith, MALodge, NJ Design and synthesis of 4-substituted benzamides as potent, selective, and orally bioavailable I(Ks) blockers. J Med Chem 44:3764-7 (2001)  
Target
Name:
Potassium voltage-gated channel subfamily KQT member 1
Synonyms:
IKs producing slow voltage-gated potassium channel subunit alpha KvLQT1 KCNQ1_CAVPO KVLQT1 Voltage-gated potassium channel subunit Kv7.1
Type:
PROTEIN
Mol. Mass.:
74450.11
Organism:
Cavia porcellus
Description:
ChEMBL_88894
Residue:
671
  
Inhibitor
Name:
BDBM50061218
Synonyms:
(E)-3-(2,4-Dichloro-phenyl)-N-((R)-1-methyl-2-oxo-5-phenyl-2,3-dihydro-1H-benzo[e][1,4]diazepin-3-yl)-acrylamide CHEMBL332826
Type:
Small organic molecule
Emp. Form.:
C25H19Cl2N3O2
Mol. Mass.:
464.343
SMILES:
CN1c2ccccc2C(=N[C@@H](NC(=O)\C=C\c2ccc(Cl)cc2Cl)C1=O)c1ccccc1
: